{"text_format":"1","workbook":"xlsx","n_sheets":13,"sheets":["入力上の注意","開催個人種目一覧表","競技者一覧","リレー","個人種目出場種目数","参加費集計シート","種目一覧シート","種目コード一覧","団体CSV","リレーCSV","学校名簿","学校番号表","Sheet4"],"not_rendered":{"charts":0,"images":9,"macros":1,"external_links":0,"defined_names":22,"comments":0,"pivot_tables":0},"unopened":[],"bounds":{"document_bytes":16777216,"sheet_cells":100000,"rows_first":2000,"rows_last":500,"rows_between":2000,"halvings":0,"cell_chars":16384,"cell_head_chars":4096},"cells_cut":0,"cells_raw":0,"read":"whole","date_system":"1900"}

{"sheet":"入力上の注意","index":0,"n_rows":63,"n_cols":16,"rows_kept":63,"cut":false,"hidden":false,"merged":[]}
[]
[null,"申込み作成上の注意事項"]
[null,"※必ず①～⑫の注意事項をすべてご確認の上、必ず守ってお申込みお願いします。"]
[null,"※ただし、同団体で陸協登録が異なる場合は、エントリーファイルを分けてください!!"]
[]
[null,"①"]
{"$rows_left_out":58}
{"sheet":"開催個人種目一覧表","index":1,"n_rows":62,"n_cols":14,"rows_kept":62,"cut":false,"hidden":false,"merged":[[0,0,0,1],[0,12,0,13],[0,10,0,11],[0,8,0,9],[0,6,0,7],[0,4,0,5],[0,2,0,3]]}
["第1回",null,"第2回",null,"第3回",null,"第4回",null,"第5回",null,"第6回",null,"第7回"]
["中学男子 １００ｍ","中学女子 １００ｍ","中学男子 １００ｍ","中学女子 １００ｍ","【1日目】","【1日目】","中学男子 １００ｍ","中学女子 １００ｍ","中学男子 １００ｍ","中学女子 １００ｍ","【1日目】","【1日目】","中学男子 １００ｍ","中学女子 １００ｍ"]
["中学男子 ２００ｍ","中学女子 ２００ｍ","中学男子 ２００ｍ","中学女子 ２００ｍ","1日目 中学男子 １００ｍ","1日目 中学女子 １００ｍ","中学男子 ２００ｍ","中学女子 ２００ｍ","中学男子 ２００ｍ","中学女子 ２００ｍ","中学男子 ２００ｍ","中学女子 ２００ｍ","中学男子 ２００ｍ","中学女子 ２００ｍ"]
["中学男子 ４００ｍ","中学女子 ８００ｍ","中学男子 ４００ｍ","中学女子 ８００ｍ","1日目 中学男子 ２００ｍ","1日目 中学女子 ２００ｍ","中学男子 ４００ｍ","中学女子 ８００ｍ","中学男子 ４００ｍ","中学女子 ８００ｍ","中学男子 ４００ｍ","中学女子 ８００ｍ","中学男子 ４００ｍ","中学女子  ８００ｍ"]
["中学男子 ８００ｍ","中学女子 １５００ｍ","中学男子 ８００ｍ","中学女子 １５００ｍ","1日目 中学男子 ４００ｍ","1日目 中学女子 ８００ｍ","中学男子 ８００ｍ","中学女子 １５００ｍ","中学男子 ８００ｍ","中学女子 １５００ｍ","中学男子 ８００ｍ","中学女子 １５００ｍ","中学男子  ８００ｍ","中学女子 １５００ｍ"]
["中学男子 １５００ｍ","中学女子 １００ｍＨ","中学男子 １５００ｍ","中学女子 １００ｍＨ","1日目 中学男子 ８００ｍ","1日目 中学女子 １５００ｍ","中学男子 １５００ｍ","中学女子 １００ｍＨ","中学男子 １５００ｍ","中学女子 １００ｍＨ","中学男子 １５００ｍ","中学女子 走高跳","中学男子 １５００ｍ","中学女子 １００ｍＨ"]
{"$rows_left_out":57}
{"sheet":"競技者一覧","index":2,"n_rows":112,"n_cols":29,"rows_kept":112,"cut":false,"hidden":false,"merged":[[10,16,10,17],[10,18,10,19],[10,20,10,21],[10,14,10,15],[10,6,10,7],[10,8,10,9],[10,12,10,13],[1,6,2,9],[1,4,2,5],[10,1,10,5],[3,1,3,3],[1,1,2,3],[3,10,3,11],[10,10,10,11],[5,6,7,6]]}
[]
[null,"2019年度",null,null,null,null,"奈良市陸協記録会　競技者参加申込一覧表"]
[]
[null,null,null,null,null,null,null,null,null,null,"参加種目数"]
[null,null,null,null,null,null,null,"希望パート","名前",null,"個人種目(混成以外)","リレー"]
[null,"府県名",null,null,null,null,"役員",null,null,null,{"$f":"SUM(個人種目出場種目数!J2:J19,個人種目出場種目数!J21:J32,個人種目出場種目数!J34:J51,個人種目出場種目数!J53:J67,個人種目出場種目数!J69:J86,個人種目出場種目数!J88:J99,個人種目出場種目数!J101:J151,個人種目出場種目数!J153:J164,個人種目出場種目数!J166:J198)","v":0},{"$f":"COUNTA(リレー!C7:C36)","v":0}]
{"$rows_left_out":107}
{"sheet":"リレー","index":3,"n_rows":36,"n_cols":13,"rows_kept":36,"cut":false,"hidden":false,"merged":[]}
[]
[null,"リレー　エントリーファイル"]
[]
[]
[]
[null,"チーム名","コード","最近の最高記録","選手1","選手2","選手3","選手4","選手5","選手6",null,"種目"]
{"$rows_left_out":31}
{"sheet":"個人種目出場種目数","index":4,"n_rows":198,"n_cols":10,"rows_kept":198,"cut":false,"hidden":false,"merged":[]}
[null,null,null,null,null,null,null,null,null,"計"]
["中学男子 １００ｍ",{"$f":"COUNTIF(競技者一覧!$G$13:$G$112,A2)","v":0},{"$f":"COUNTIF(競技者一覧!$I$13:$I$112,A2)","v":0},{"$f":"COUNTIF(競技者一覧!$K$13:$K$112,A2)","v":0},{"$f":"COUNTIF(競技者一覧!$M$13:$M$112,A2)","v":0},{"$f":"COUNTIF(競技者一覧!$O$13:$O$112,A2)","v":0},{"$f":"COUNTIF(競技者一覧!$Q$13:$Q$112,A2)","v":0},{"$f":"COUNTIF(競技者一覧!$S$13:$S$112,A2)","v":0},{"$f":"COUNTIF(競技者一覧!$U$13:$U$112,A2)","v":0},{"$f":"SUM(B2:I2)","v":0}]
["中学男子 ２００ｍ",{"$f":"COUNTIF(競技者一覧!$G$13:$G$112,A3)","v":0},{"$f":"COUNTIF(競技者一覧!$I$13:$I$112,A3)","v":0},{"$f":"COUNTIF(競技者一覧!$K$13:$K$112,A3)","v":0},{"$f":"COUNTIF(競技者一覧!$M$13:$M$112,A3)","v":0},{"$f":"COUNTIF(競技者一覧!$O$13:$O$112,A3)","v":0},{"$f":"COUNTIF(競技者一覧!$Q$13:$Q$112,A3)","v":0},{"$f":"COUNTIF(競技者一覧!$S$13:$S$112,A3)","v":0},{"$f":"COUNTIF(競技者一覧!$U$13:$U$112,A3)","v":0},{"$f":"SUM(B3:I3)","v":0}]
["中学男子 ４００ｍ",{"$f":"COUNTIF(競技者一覧!$G$13:$G$112,A4)","v":0},{"$f":"COUNTIF(競技者一覧!$I$13:$I$112,A4)","v":0},{"$f":"COUNTIF(競技者一覧!$K$13:$K$112,A4)","v":0},{"$f":"COUNTIF(競技者一覧!$M$13:$M$112,A4)","v":0},{"$f":"COUNTIF(競技者一覧!$O$13:$O$112,A4)","v":0},{"$f":"COUNTIF(競技者一覧!$Q$13:$Q$112,A4)","v":0},{"$f":"COUNTIF(競技者一覧!$S$13:$S$112,A4)","v":0},{"$f":"COUNTIF(競技者一覧!$U$13:$U$112,A4)","v":0},0]
["中学男子 ８００ｍ",{"$f":"COUNTIF(競技者一覧!$G$13:$G$112,A5)","v":0},{"$f":"COUNTIF(競技者一覧!$I$13:$I$112,A5)","v":0},{"$f":"COUNTIF(競技者一覧!$K$13:$K$112,A5)","v":0},{"$f":"COUNTIF(競技者一覧!$M$13:$M$112,A5)","v":0},{"$f":"COUNTIF(競技者一覧!$O$13:$O$112,A5)","v":0},{"$f":"COUNTIF(競技者一覧!$Q$13:$Q$112,A5)","v":0},{"$f":"COUNTIF(競技者一覧!$S$13:$S$112,A5)","v":0},{"$f":"COUNTIF(競技者一覧!$U$13:$U$112,A5)","v":0},0]
["中学男子 １５００ｍ",{"$f":"COUNTIF(競技者一覧!$G$13:$G$112,A6)","v":0},{"$f":"COUNTIF(競技者一覧!$I$13:$I$112,A6)","v":0},{"$f":"COUNTIF(競技者一覧!$K$13:$K$112,A6)","v":0},{"$f":"COUNTIF(競技者一覧!$M$13:$M$112,A6)","v":0},{"$f":"COUNTIF(競技者一覧!$O$13:$O$112,A6)","v":0},{"$f":"COUNTIF(競技者一覧!$Q$13:$Q$112,A6)","v":0},{"$f":"COUNTIF(競技者一覧!$S$13:$S$112,A6)","v":0},{"$f":"COUNTIF(競技者一覧!$U$13:$U$112,A6)","v":0},0]
{"$rows_left_out":193}
{"sheet":"参加費集計シート","index":5,"n_rows":38,"n_cols":9,"rows_kept":38,"cut":false,"hidden":false,"merged":[[0,1,0,9],[1,2,1,4],[1,6,1,7],[2,1,2,7],[3,2,3,3],[3,4,3,5],[4,2,4,3],[4,4,4,5],[5,2,5,3],[5,4,5,5],[6,2,6,3],[6,4,6,5],[7,2,7,3],[7,4,7,5],[8,2,8,3],[8,4,8,5],[9,2,9,3],[9,4,9,5],[10,2,10,3],[10,4,10,5],[11,2,11,3],[11,4,11,5],[15,0,15,8],[16,9,22,9]]}
[null,"参加費集計シート"]
[null,"団体名",{"$f":"CONCATENATE(競技者一覧!C7)","v":""},null,null,null,"都道府県",null,{"$f":"CONCATENATE(競技者一覧!C6)","v":""}]
[null,"※下記表を見て該当する欄に種目数を入れて下さい"]
[null,null,"種目数",null,"参加費",null,null,"※２９年度参加実績が２回以下の中学・高校"]
[null,"100円",null,null,{"$f":"100*C5","v":0},null,null,"　１種目５００円、四種１０００円"]
[null,"200円",null,null,{"$f":"200*C6","v":0},null,null,"　県内・県外は問いませんが、役員・補助員を出して頂きます。。"]
{"$rows_left_out":33}
{"sheet":"種目一覧シート","index":6,"n_rows":64,"n_cols":15,"rows_kept":64,"cut":false,"hidden":true,"merged":[[1,1,1,2],[1,13,1,14],[1,11,1,12],[1,9,1,10],[1,7,1,8],[1,5,1,6],[1,3,1,4]]}
[]
[null,"第1回",null,"第2回",null,"第3回",null,"第4回",null,"第5回",null,"第6回",null,"第7回"]
[null,1,2,1,2,1,2,1,2,1,2,1,2,1,2]
[null,"中学男子 １００ｍ","中学女子 １００ｍ","中学男子 １００ｍ","中学女子 １００ｍ","【1日目】","【1日目】","中学男子 １００ｍ","中学女子 １００ｍ","中学男子 １００ｍ","中学女子 １００ｍ","【1日目】","【1日目】","中学男子 １００ｍ","中学女子 １００ｍ"]
[null,"中学男子 ２００ｍ","中学女子 ２００ｍ","中学男子 ２００ｍ","中学女子 ２００ｍ","1日目 中学男子 １００ｍ","1日目 中学女子 １００ｍ","中学男子 ２００ｍ","中学女子 ２００ｍ","中学男子 ２００ｍ","中学女子 ２００ｍ","中学男子 ２００ｍ","中学女子 ２００ｍ","中学男子 ２００ｍ","中学女子 ２００ｍ"]
[null,"中学男子 ４００ｍ","中学女子 ８００ｍ","中学男子 ４００ｍ","中学女子 ８００ｍ","1日目 中学男子 ２００ｍ","1日目 中学女子 ２００ｍ","中学男子 ４００ｍ","中学女子 ８００ｍ","中学男子 ４００ｍ","中学女子 ８００ｍ","中学男子 ４００ｍ","中学女子 ８００ｍ","中学男子 ４００ｍ","中学女子  ８００ｍ"]
{"$rows_left_out":59}
{"sheet":"種目コード一覧","index":7,"n_rows":213,"n_cols":3,"rows_kept":213,"cut":false,"hidden":true,"merged":[]}
["中学男子 １００ｍ","00210",7]
["中学男子 ２００ｍ","00310",7]
["中学男子 ４００ｍ","00510",7]
["中学男子 ８００ｍ","00650",7]
["中学男子  ８００ｍ","00610",7]
["中学男子 １５００ｍ","00850",7]
{"$rows_left_out":208}
{"sheet":"団体CSV","index":8,"n_rows":101,"n_cols":15,"rows_kept":101,"cut":false,"hidden":true,"merged":[]}
["DB","N1","N2","SX","KC","MC","ZK","S1","S2","S3","S4","S5","S6","S7","S8"]
[{"$f":"CONCATENATE($F$2,Sheet4!B2)","v":{"$error":"#N/A"}},{"$f":"CONCATENATE(競技者一覧!C13,\"(\",競技者一覧!F13,\")\")","v":"()"},{"$f":"CONCATENATE(競技者一覧!D13)","v":""},{"$f":"競技者一覧!E13","v":0},{"$f":"VLOOKUP(競技者一覧!$C$6,Sheet4!$D$2:$E$48,2,FALSE)","v":{"$error":"#N/A"}},{"$f":"VLOOKUP(競技者一覧!$C$7,学校番号表!$B$2:$C$1004,2,FALSE)","v":{"$error":"#N/A"}},{"$f":"CONCATENATE(競技者一覧!B13)","v":""},{"$f":"IFERROR(CONCATENATE(VLOOKUP(競技者一覧!G13,種目コード一覧!$A$1:$C$213,2,FALSE),\" \",REPT(\"0\",VLOOKUP(競技者一覧!G13,種目コード一覧!$A$1:$C$213,3,FALSE)-LEN(競技者一覧!H13)),競技者一覧!H13),\"\")","v":""},{"$f":"IFERROR(CONCATENATE(VLOOKUP(競技者一覧!I13,種目コード一覧!$A$1:$C$213,2,FALSE),\" \",REPT(\"0\",VLOOKUP(競技者一覧!I13,種目コード一覧!$A$1:$C$213,3,FALSE)-LEN(競技者一覧!J13)),競技者一覧!J13),\"\")","v":""},{"$f":"IFERROR(CONCATENATE(VLOOKUP(競技者一覧!K13,種目コード一覧!$A$1:$C$213,2,FALSE),\" \",REPT(\"0\",VLOOKUP(競技者一覧!K13,種目コード一覧!$A$1:$C$213,3,FALSE)-LEN(競技者一覧!L13)),競技者一覧!L13),\"\")","v":""},{"$f":"IFERROR(CONCATENATE(VLOOKUP(競技者一覧!M13,種目コード一覧!$A$1:$C$213,2,FALSE),\" \",REPT(\"0\",VLOOKUP(競技者一覧!M13,種目コード一覧!$A$1:$C$213,3,FALSE)-LEN(競技者一覧!N13)),競技者一覧!N13),\"\")","v":""},{"$f":"IFERROR(CONCATENATE(VLOOKUP(競技者一覧!O13,種目コード一覧!$A$1:$C$213,2,FALSE),\" \",REPT(\"0\",VLOOKUP(競技者一覧!O13,種目コード一覧!$A$1:$C$213,3,FALSE)-LEN(競技者一覧!P13)),競技者一覧!P13),\"\")","v":""},{"$f":"IFERROR(CONCATENATE(VLOOKUP(競技者一覧!Q13,種目コード一覧!$A$1:$C$213,2,FALSE),\" \",REPT(\"0\",VLOOKUP(競技者一覧!Q13,種目コード一覧!$A$1:$C$213,3,FALSE)-LEN(競技者一覧!R13)),競技者一覧!R13),\"\")","v":""},{"$f":"IFERROR(CONCATENATE(VLOOKUP(競技者一覧!S13,種目コード一覧!$A$1:$C$213,2,FALSE),\" \",REPT(\"0\",VLOOKUP(競技者一覧!S13,種目コード一覧!$A$1:$C$213,3,FALSE)-LEN(競技者一覧!T13)),競技者一覧!T13),\"\")","v":""},{"$f":"IFERROR(CONCATENATE(VLOOKUP(競技者一覧!U13,種目コード一覧!$A$1:$C$213,2,FALSE),\" \",REPT(\"0\",VLOOKUP(競技者一覧!U13,種目コード一覧!$A$1:$C$213,3,FALSE)-LEN(競技者一覧!V13)),競技者一覧!V13),\"\")","v":""}]
[{"$f":"CONCATENATE($F$2,Sheet4!B3)","v":{"$error":"#N/A"}},{"$f":"CONCATENATE(競技者一覧!C14,\"(\",競技者一覧!F14,\")\")","v":"()"},{"$f":"CONCATENATE(競技者一覧!D14)","v":""},{"$f":"競技者一覧!E14","v":0},{"$f":"VLOOKUP(競技者一覧!$C$6,Sheet4!$D$2:$E$48,2,FALSE)","v":{"$error":"#N/A"}},{"$f":"VLOOKUP(競技者一覧!$C$7,学校番号表!$B$2:$C$1004,2,FALSE)","v":{"$error":"#N/A"}},{"$f":"CONCATENATE(競技者一覧!B14)","v":""},{"$f":"IFERROR(CONCATENATE(VLOOKUP(競技者一覧!G14,種目コード一覧!$A$1:$C$213,2,FALSE),\" \",REPT(\"0\",VLOOKUP(競技者一覧!G14,種目コード一覧!$A$1:$C$213,3,FALSE)-LEN(競技者一覧!H14)),競技者一覧!H14),\"\")","v":""},{"$f":"IFERROR(CONCATENATE(VLOOKUP(競技者一覧!I14,種目コード一覧!$A$1:$C$213,2,FALSE),\" \",REPT(\"0\",VLOOKUP(競技者一覧!I14,種目コード一覧!$A$1:$C$213,3,FALSE)-LEN(競技者一覧!J14)),競技者一覧!J14),\"\")","v":""},{"$f":"IFERROR(CONCATENATE(VLOOKUP(競技者一覧!K14,種目コード一覧!$A$1:$C$213,2,FALSE),\" \",REPT(\"0\",VLOOKUP(競技者一覧!K14,種目コード一覧!$A$1:$C$213,3,FALSE)-LEN(競技者一覧!L14)),競技者一覧!L14),\"\")","v":""},{"$f":"IFERROR(CONCATENATE(VLOOKUP(競技者一覧!M14,種目コード一覧!$A$1:$C$213,2,FALSE),\" \",REPT(\"0\",VLOOKUP(競技者一覧!M14,種目コード一覧!$A$1:$C$213,3,FALSE)-LEN(競技者一覧!N14)),競技者一覧!N14),\"\")","v":""},{"$f":"IFERROR(CONCATENATE(VLOOKUP(競技者一覧!O14,種目コード一覧!$A$1:$C$213,2,FALSE),\" \",REPT(\"0\",VLOOKUP(競技者一覧!O14,種目コード一覧!$A$1:$C$213,3,FALSE)-LEN(競技者一覧!P14)),競技者一覧!P14),\"\")","v":""},{"$f":"IFERROR(CONCATENATE(VLOOKUP(競技者一覧!Q14,種目コード一覧!$A$1:$C$213,2,FALSE),\" \",REPT(\"0\",VLOOKUP(競技者一覧!Q14,種目コード一覧!$A$1:$C$213,3,FALSE)-LEN(競技者一覧!R14)),競技者一覧!R14),\"\")","v":""},{"$f":"IFERROR(CONCATENATE(VLOOKUP(競技者一覧!S14,種目コード一覧!$A$1:$C$213,2,FALSE),\" \",REPT(\"0\",VLOOKUP(競技者一覧!S14,種目コード一覧!$A$1:$C$213,3,FALSE)-LEN(競技者一覧!T14)),競技者一覧!T14),\"\")","v":""},{"$f":"IFERROR(CONCATENATE(VLOOKUP(競技者一覧!U14,種目コード一覧!$A$1:$C$213,2,FALSE),\" \",REPT(\"0\",VLOOKUP(競技者一覧!U14,種目コード一覧!$A$1:$C$213,3,FALSE)-LEN(競技者一覧!V14)),競技者一覧!V14),\"\")","v":""}]
[{"$f":"CONCATENATE($F$2,Sheet4!B4)","v":{"$error":"#N/A"}},{"$f":"CONCATENATE(競技者一覧!C15,\"(\",競技者一覧!F15,\")\")","v":"()"},{"$f":"CONCATENATE(競技者一覧!D15)","v":""},{"$f":"競技者一覧!E15","v":0},{"$f":"VLOOKUP(競技者一覧!$C$6,Sheet4!$D$2:$E$48,2,FALSE)","v":{"$error":"#N/A"}},{"$f":"VLOOKUP(競技者一覧!$C$7,学校番号表!$B$2:$C$1004,2,FALSE)","v":{"$error":"#N/A"}},{"$f":"CONCATENATE(競技者一覧!B15)","v":""},{"$f":"IFERROR(CONCATENATE(VLOOKUP(競技者一覧!G15,種目コード一覧!$A$1:$C$213,2,FALSE),\" \",REPT(\"0\",VLOOKUP(競技者一覧!G15,種目コード一覧!$A$1:$C$213,3,FALSE)-LEN(競技者一覧!H15)),競技者一覧!H15),\"\")","v":""},{"$f":"IFERROR(CONCATENATE(VLOOKUP(競技者一覧!I15,種目コード一覧!$A$1:$C$213,2,FALSE),\" \",REPT(\"0\",VLOOKUP(競技者一覧!I15,種目コード一覧!$A$1:$C$213,3,FALSE)-LEN(競技者一覧!J15)),競技者一覧!J15),\"\")","v":""},{"$f":"IFERROR(CONCATENATE(VLOOKUP(競技者一覧!K15,種目コード一覧!$A$1:$C$213,2,FALSE),\" \",REPT(\"0\",VLOOKUP(競技者一覧!K15,種目コード一覧!$A$1:$C$213,3,FALSE)-LEN(競技者一覧!L15)),競技者一覧!L15),\"\")","v":""},{"$f":"IFERROR(CONCATENATE(VLOOKUP(競技者一覧!M15,種目コード一覧!$A$1:$C$213,2,FALSE),\" \",REPT(\"0\",VLOOKUP(競技者一覧!M15,種目コード一覧!$A$1:$C$213,3,FALSE)-LEN(競技者一覧!N15)),競技者一覧!N15),\"\")","v":""},{"$f":"IFERROR(CONCATENATE(VLOOKUP(競技者一覧!O15,種目コード一覧!$A$1:$C$213,2,FALSE),\" \",REPT(\"0\",VLOOKUP(競技者一覧!O15,種目コード一覧!$A$1:$C$213,3,FALSE)-LEN(競技者一覧!P15)),競技者一覧!P15),\"\")","v":""},{"$f":"IFERROR(CONCATENATE(VLOOKUP(競技者一覧!Q15,種目コード一覧!$A$1:$C$213,2,FALSE),\" \",REPT(\"0\",VLOOKUP(競技者一覧!Q15,種目コード一覧!$A$1:$C$213,3,FALSE)-LEN(競技者一覧!R15)),競技者一覧!R15),\"\")","v":""},{"$f":"IFERROR(CONCATENATE(VLOOKUP(競技者一覧!S15,種目コード一覧!$A$1:$C$213,2,FALSE),\" \",REPT(\"0\",VLOOKUP(競技者一覧!S15,種目コード一覧!$A$1:$C$213,3,FALSE)-LEN(競技者一覧!T15)),競技者一覧!T15),\"\")","v":""},{"$f":"IFERROR(CONCATENATE(VLOOKUP(競技者一覧!U15,種目コード一覧!$A$1:$C$213,2,FALSE),\" \",REPT(\"0\",VLOOKUP(競技者一覧!U15,種目コード一覧!$A$1:$C$213,3,FALSE)-LEN(競技者一覧!V15)),競技者一覧!V15),\"\")","v":""}]
[{"$f":"CONCATENATE($F$2,Sheet4!B5)","v":{"$error":"#N/A"}},{"$f":"CONCATENATE(競技者一覧!C16,\"(\",競技者一覧!F16,\")\")","v":"()"},{"$f":"CONCATENATE(競技者一覧!D16)","v":""},{"$f":"競技者一覧!E16","v":0},{"$f":"VLOOKUP(競技者一覧!$C$6,Sheet4!$D$2:$E$48,2,FALSE)","v":{"$error":"#N/A"}},{"$f":"VLOOKUP(競技者一覧!$C$7,学校番号表!$B$2:$C$1004,2,FALSE)","v":{"$error":"#N/A"}},{"$f":"CONCATENATE(競技者一覧!B16)","v":""},{"$f":"IFERROR(CONCATENATE(VLOOKUP(競技者一覧!G16,種目コード一覧!$A$1:$C$213,2,FALSE),\" \",REPT(\"0\",VLOOKUP(競技者一覧!G16,種目コード一覧!$A$1:$C$213,3,FALSE)-LEN(競技者一覧!H16)),競技者一覧!H16),\"\")","v":""},{"$f":"IFERROR(CONCATENATE(VLOOKUP(競技者一覧!I16,種目コード一覧!$A$1:$C$213,2,FALSE),\" \",REPT(\"0\",VLOOKUP(競技者一覧!I16,種目コード一覧!$A$1:$C$213,3,FALSE)-LEN(競技者一覧!J16)),競技者一覧!J16),\"\")","v":""},{"$f":"IFERROR(CONCATENATE(VLOOKUP(競技者一覧!K16,種目コード一覧!$A$1:$C$213,2,FALSE),\" \",REPT(\"0\",VLOOKUP(競技者一覧!K16,種目コード一覧!$A$1:$C$213,3,FALSE)-LEN(競技者一覧!L16)),競技者一覧!L16),\"\")","v":""},{"$f":"IFERROR(CONCATENATE(VLOOKUP(競技者一覧!M16,種目コード一覧!$A$1:$C$213,2,FALSE),\" \",REPT(\"0\",VLOOKUP(競技者一覧!M16,種目コード一覧!$A$1:$C$213,3,FALSE)-LEN(競技者一覧!N16)),競技者一覧!N16),\"\")","v":""},{"$f":"IFERROR(CONCATENATE(VLOOKUP(競技者一覧!O16,種目コード一覧!$A$1:$C$213,2,FALSE),\" \",REPT(\"0\",VLOOKUP(競技者一覧!O16,種目コード一覧!$A$1:$C$213,3,FALSE)-LEN(競技者一覧!P16)),競技者一覧!P16),\"\")","v":""},{"$f":"IFERROR(CONCATENATE(VLOOKUP(競技者一覧!Q16,種目コード一覧!$A$1:$C$213,2,FALSE),\" \",REPT(\"0\",VLOOKUP(競技者一覧!Q16,種目コード一覧!$A$1:$C$213,3,FALSE)-LEN(競技者一覧!R16)),競技者一覧!R16),\"\")","v":""},{"$f":"IFERROR(CONCATENATE(VLOOKUP(競技者一覧!S16,種目コード一覧!$A$1:$C$213,2,FALSE),\" \",REPT(\"0\",VLOOKUP(競技者一覧!S16,種目コード一覧!$A$1:$C$213,3,FALSE)-LEN(競技者一覧!T16)),競技者一覧!T16),\"\")","v":""},{"$f":"IFERROR(CONCATENATE(VLOOKUP(競技者一覧!U16,種目コード一覧!$A$1:$C$213,2,FALSE),\" \",REPT(\"0\",VLOOKUP(競技者一覧!U16,種目コード一覧!$A$1:$C$213,3,FALSE)-LEN(競技者一覧!V16)),競技者一覧!V16),\"\")","v":""}]
[{"$f":"CONCATENATE($F$2,Sheet4!B6)","v":{"$error":"#N/A"}},{"$f":"CONCATENATE(競技者一覧!C17,\"(\",競技者一覧!F17,\")\")","v":"()"},{"$f":"CONCATENATE(競技者一覧!D17)","v":""},{"$f":"競技者一覧!E17","v":0},{"$f":"VLOOKUP(競技者一覧!$C$6,Sheet4!$D$2:$E$48,2,FALSE)","v":{"$error":"#N/A"}},{"$f":"VLOOKUP(競技者一覧!$C$7,学校番号表!$B$2:$C$1004,2,FALSE)","v":{"$error":"#N/A"}},{"$f":"CONCATENATE(競技者一覧!B17)","v":""},{"$f":"IFERROR(CONCATENATE(VLOOKUP(競技者一覧!G17,種目コード一覧!$A$1:$C$213,2,FALSE),\" \",REPT(\"0\",VLOOKUP(競技者一覧!G17,種目コード一覧!$A$1:$C$213,3,FALSE)-LEN(競技者一覧!H17)),競技者一覧!H17),\"\")","v":""},{"$f":"IFERROR(CONCATENATE(VLOOKUP(競技者一覧!I17,種目コード一覧!$A$1:$C$213,2,FALSE),\" \",REPT(\"0\",VLOOKUP(競技者一覧!I17,種目コード一覧!$A$1:$C$213,3,FALSE)-LEN(競技者一覧!J17)),競技者一覧!J17),\"\")","v":""},{"$f":"IFERROR(CONCATENATE(VLOOKUP(競技者一覧!K17,種目コード一覧!$A$1:$C$213,2,FALSE),\" \",REPT(\"0\",VLOOKUP(競技者一覧!K17,種目コード一覧!$A$1:$C$213,3,FALSE)-LEN(競技者一覧!L17)),競技者一覧!L17),\"\")","v":""},{"$f":"IFERROR(CONCATENATE(VLOOKUP(競技者一覧!M17,種目コード一覧!$A$1:$C$213,2,FALSE),\" \",REPT(\"0\",VLOOKUP(競技者一覧!M17,種目コード一覧!$A$1:$C$213,3,FALSE)-LEN(競技者一覧!N17)),競技者一覧!N17),\"\")","v":""},{"$f":"IFERROR(CONCATENATE(VLOOKUP(競技者一覧!O17,種目コード一覧!$A$1:$C$213,2,FALSE),\" \",REPT(\"0\",VLOOKUP(競技者一覧!O17,種目コード一覧!$A$1:$C$213,3,FALSE)-LEN(競技者一覧!P17)),競技者一覧!P17),\"\")","v":""},{"$f":"IFERROR(CONCATENATE(VLOOKUP(競技者一覧!Q17,種目コード一覧!$A$1:$C$213,2,FALSE),\" \",REPT(\"0\",VLOOKUP(競技者一覧!Q17,種目コード一覧!$A$1:$C$213,3,FALSE)-LEN(競技者一覧!R17)),競技者一覧!R17),\"\")","v":""},{"$f":"IFERROR(CONCATENATE(VLOOKUP(競技者一覧!S17,種目コード一覧!$A$1:$C$213,2,FALSE),\" \",REPT(\"0\",VLOOKUP(競技者一覧!S17,種目コード一覧!$A$1:$C$213,3,FALSE)-LEN(競技者一覧!T17)),競技者一覧!T17),\"\")","v":""},{"$f":"IFERROR(CONCATENATE(VLOOKUP(競技者一覧!U17,種目コード一覧!$A$1:$C$213,2,FALSE),\" \",REPT(\"0\",VLOOKUP(競技者一覧!U17,種目コード一覧!$A$1:$C$213,3,FALSE)-LEN(競技者一覧!V17)),競技者一覧!V17),\"\")","v":""}]
{"$rows_left_out":96}
{"sheet":"リレーCSV","index":9,"n_rows":31,"n_cols":15,"rows_kept":31,"cut":false,"hidden":true,"merged":[]}
[null,"DB","ZK","KC","N1","N2","TM","KM","LN","S1","S2","S3","S4","S5","S6"]
[{"$f":"CONCATENATE(リレー!C7)","v":""},{"$f":"CONCATENATE(団体CSV!$F$2)","v":{"$error":"#N/A"}},null,{"$f":"CONCATENATE(団体CSV!$E$2)","v":{"$error":"#N/A"}},{"$f":"CONCATENATE(リレー!B7)","v":""},null,{"$f":"CONCATENATE(Sheet4!$G$2,リレー!D7)","v":"000"},null,null,{"$f":"IFERROR(CONCATENATE(VLOOKUP(リレー!E7,学校名簿!$B$2:$C$101,2,FALSE)),\"\")","v":""},{"$f":"IFERROR(CONCATENATE(VLOOKUP(リレー!F7,学校名簿!$B$2:$C$101,2,FALSE)),\"\")","v":""},{"$f":"IFERROR(CONCATENATE(VLOOKUP(リレー!G7,学校名簿!$B$2:$C$101,2,FALSE)),\"\")","v":""},{"$f":"IFERROR(CONCATENATE(VLOOKUP(リレー!H7,学校名簿!$B$2:$C$101,2,FALSE)),\"\")","v":""},{"$f":"IFERROR(CONCATENATE(VLOOKUP(リレー!I7,学校名簿!$B$2:$C$101,2,FALSE)),\"\")","v":""},{"$f":"IFERROR(CONCATENATE(VLOOKUP(リレー!J7,学校名簿!$B$2:$C$101,2,FALSE)),\"\")","v":""}]
[{"$f":"CONCATENATE(リレー!C8)","v":""},{"$f":"CONCATENATE(団体CSV!$F$2)","v":{"$error":"#N/A"}},null,{"$f":"CONCATENATE(団体CSV!$E$2)","v":{"$error":"#N/A"}},{"$f":"CONCATENATE(リレー!B8)","v":""},null,{"$f":"CONCATENATE(Sheet4!$G$2,リレー!D8)","v":"000"},null,null,{"$f":"IFERROR(CONCATENATE(VLOOKUP(リレー!E8,学校名簿!$B$2:$C$101,2,FALSE)),\"\")","v":""},{"$f":"IFERROR(CONCATENATE(VLOOKUP(リレー!F8,学校名簿!$B$2:$C$101,2,FALSE)),\"\")","v":""},{"$f":"IFERROR(CONCATENATE(VLOOKUP(リレー!G8,学校名簿!$B$2:$C$101,2,FALSE)),\"\")","v":""},{"$f":"IFERROR(CONCATENATE(VLOOKUP(リレー!H8,学校名簿!$B$2:$C$101,2,FALSE)),\"\")","v":""},{"$f":"IFERROR(CONCATENATE(VLOOKUP(リレー!I8,学校名簿!$B$2:$C$101,2,FALSE)),\"\")","v":""},{"$f":"IFERROR(CONCATENATE(VLOOKUP(リレー!J8,学校名簿!$B$2:$C$101,2,FALSE)),\"\")","v":""}]
[{"$f":"CONCATENATE(リレー!C9)","v":""},{"$f":"CONCATENATE(団体CSV!$F$2)","v":{"$error":"#N/A"}},null,{"$f":"CONCATENATE(団体CSV!$E$2)","v":{"$error":"#N/A"}},{"$f":"CONCATENATE(リレー!B9)","v":""},null,{"$f":"CONCATENATE(Sheet4!$G$2,リレー!D9)","v":"000"},null,null,{"$f":"IFERROR(CONCATENATE(VLOOKUP(リレー!E9,学校名簿!$B$2:$C$101,2,FALSE)),\"\")","v":""},{"$f":"IFERROR(CONCATENATE(VLOOKUP(リレー!F9,学校名簿!$B$2:$C$101,2,FALSE)),\"\")","v":""},{"$f":"IFERROR(CONCATENATE(VLOOKUP(リレー!G9,学校名簿!$B$2:$C$101,2,FALSE)),\"\")","v":""},{"$f":"IFERROR(CONCATENATE(VLOOKUP(リレー!H9,学校名簿!$B$2:$C$101,2,FALSE)),\"\")","v":""},{"$f":"IFERROR(CONCATENATE(VLOOKUP(リレー!I9,学校名簿!$B$2:$C$101,2,FALSE)),\"\")","v":""},{"$f":"IFERROR(CONCATENATE(VLOOKUP(リレー!J9,学校名簿!$B$2:$C$101,2,FALSE)),\"\")","v":""}]
[{"$f":"CONCATENATE(リレー!C10)","v":""},{"$f":"CONCATENATE(団体CSV!$F$2)","v":{"$error":"#N/A"}},null,{"$f":"CONCATENATE(団体CSV!$E$2)","v":{"$error":"#N/A"}},{"$f":"CONCATENATE(リレー!B10)","v":""},null,{"$f":"CONCATENATE(Sheet4!$G$2,リレー!D10)","v":"000"},null,null,{"$f":"IFERROR(CONCATENATE(VLOOKUP(リレー!E10,学校名簿!$B$2:$C$101,2,FALSE)),\"\")","v":""},{"$f":"IFERROR(CONCATENATE(VLOOKUP(リレー!F10,学校名簿!$B$2:$C$101,2,FALSE)),\"\")","v":""},{"$f":"IFERROR(CONCATENATE(VLOOKUP(リレー!G10,学校名簿!$B$2:$C$101,2,FALSE)),\"\")","v":""},{"$f":"IFERROR(CONCATENATE(VLOOKUP(リレー!H10,学校名簿!$B$2:$C$101,2,FALSE)),\"\")","v":""},{"$f":"IFERROR(CONCATENATE(VLOOKUP(リレー!I10,学校名簿!$B$2:$C$101,2,FALSE)),\"\")","v":""},{"$f":"IFERROR(CONCATENATE(VLOOKUP(リレー!J10,学校名簿!$B$2:$C$101,2,FALSE)),\"\")","v":""}]
[{"$f":"CONCATENATE(リレー!C11)","v":""},{"$f":"CONCATENATE(団体CSV!$F$2)","v":{"$error":"#N/A"}},null,{"$f":"CONCATENATE(団体CSV!$E$2)","v":{"$error":"#N/A"}},{"$f":"CONCATENATE(リレー!B11)","v":""},null,{"$f":"CONCATENATE(Sheet4!$G$2,リレー!D11)","v":"000"},null,null,{"$f":"IFERROR(CONCATENATE(VLOOKUP(リレー!E11,学校名簿!$B$2:$C$101,2,FALSE)),\"\")","v":""},{"$f":"IFERROR(CONCATENATE(VLOOKUP(リレー!F11,学校名簿!$B$2:$C$101,2,FALSE)),\"\")","v":""},{"$f":"IFERROR(CONCATENATE(VLOOKUP(リレー!G11,学校名簿!$B$2:$C$101,2,FALSE)),\"\")","v":""},{"$f":"IFERROR(CONCATENATE(VLOOKUP(リレー!H11,学校名簿!$B$2:$C$101,2,FALSE)),\"\")","v":""},{"$f":"IFERROR(CONCATENATE(VLOOKUP(リレー!I11,学校名簿!$B$2:$C$101,2,FALSE)),\"\")","v":""},{"$f":"IFERROR(CONCATENATE(VLOOKUP(リレー!J11,学校名簿!$B$2:$C$101,2,FALSE)),\"\")","v":""}]
{"$rows_left_out":26}
{"sheet":"学校名簿","index":10,"n_rows":101,"n_cols":8,"rows_kept":101,"cut":false,"hidden":true,"merged":[[1,5,1,7]]}
[null,"名前","DB"]
[null,{"$f":"CONCATENATE(競技者一覧!C13)","v":""},{"$f":"CONCATENATE(団体CSV!A2)","v":{"$error":"#N/A"}},null,null,"役員名"]
[null,{"$f":"CONCATENATE(競技者一覧!C14)","v":""},{"$f":"CONCATENATE(団体CSV!A3)","v":{"$error":"#N/A"}},null,{"$f":"CONCATENATE(競技者一覧!$C$8)","v":""},{"$f":"CONCATENATE(競技者一覧!$H$6)","v":""},{"$f":"CONCATENATE(競技者一覧!$H$7)","v":""},{"$f":"CONCATENATE(競技者一覧!$H$8)","v":""}]
[null,{"$f":"CONCATENATE(競技者一覧!C15)","v":""},{"$f":"CONCATENATE(団体CSV!A4)","v":{"$error":"#N/A"}}]
[null,{"$f":"CONCATENATE(競技者一覧!C16)","v":""},{"$f":"CONCATENATE(団体CSV!A5)","v":{"$error":"#N/A"}}]
[null,{"$f":"CONCATENATE(競技者一覧!C17)","v":""},{"$f":"CONCATENATE(団体CSV!A6)","v":{"$error":"#N/A"}}]
{"$rows_left_out":96}
{"sheet":"学校番号表","index":11,"n_rows":539,"n_cols":3,"rows_kept":539,"cut":false,"hidden":true,"merged":[]}
[null,"N3","DB"]
[null,"日本生命",130001]
[null,"東京陸協",130002]
[null,"川崎市陸協",140001]
[null,"福井市役所",180001]
[null,"福井陸協",180002]
{"$rows_left_out":534}
{"sheet":"Sheet4","index":12,"n_rows":101,"n_cols":7,"rows_kept":101,"cut":false,"hidden":true,"merged":[]}
[]
[null,"001",null,"北海道",1,null,"000"]
[null,"002",null,"青森",2]
[null,"003",null,"岩手",3]
[null,"004",null,"宮城",4]
[null,"005",null,"秋田",5]
{"$rows_left_out":95}